Target
Heat shock factor protein 1
Ligand
BDBM63291
Substrate
Meas. Tech.
Luminescence Cell-Based Dose Confimation HTS to Identify Inhibitors of Heat Shock Factor 1 (HSF1)
EC50
>195000±0 nM
Citation
 PubChem, PC Luminescence Cell-Based Dose Confimation HTS to Identify Inhibitors of Heat Shock Factor 1 (HSF1) PubChem Bioassay (2010)[AID] 
Target
Name:
Heat shock factor protein 1
Synonyms:
HSF1_MOUSE Hsf1 protein
Type:
Enzyme Catalytic Domain
Mol. Mass.:
57208.68
Organism:
Mus musculus
Description:
P38532
Residue:
525
  
Inhibitor
Name:
BDBM63291
Synonyms:
2-[[oxo(pyridin-4-yl)methyl]amino]-3-pyridinecarboxylic acid ethyl ester MLS000756204 cid_901889 ethyl 2-(pyridin-4-ylcarbonylamino)pyridine-3-carboxylate | ethyl 2-(pyridine-4-carbonylamino)pyridine-3-carboxylate
Type:
Small organic molecule
Emp. Form.:
C14H13N3O3
Mol. Mass.:
271.2713
SMILES:
CCOC(=O)c1cccnc1NC(=O)c1ccncc1
: