Target
Heat shock factor protein 1
Ligand
BDBM63375
Substrate
Meas. Tech.
Luminescence Cell-Based Dose Confimation HTS to Identify Inhibitors of Heat Shock Factor 1 (HSF1)
EC50
>195000±0 nM
Citation
 PubChem, PC Luminescence Cell-Based Dose Confimation HTS to Identify Inhibitors of Heat Shock Factor 1 (HSF1) PubChem Bioassay (2010)[AID] 
Target
Name:
Heat shock factor protein 1
Synonyms:
HSF1_MOUSE Hsf1 protein
Type:
Enzyme Catalytic Domain
Mol. Mass.:
57208.68
Organism:
Mus musculus
Description:
P38532
Residue:
525
  
Inhibitor
Name:
BDBM63375
Synonyms:
2-(1,2-dimethyl-3-indolyl)-2-oxo-N-(thiophen-2-ylmethyl)acetamide 2-(1,2-dimethylindol-3-yl)-2-oxidanylidene-N-(thiophen-2-ylmethyl)ethanamide MLS000684773 cid_7087299
Type:
Small organic molecule
Emp. Form.:
C17H16N2O2S
Mol. Mass.:
312.386
SMILES:
Cc1c(C(=O)C(=O)NCc2cccs2)c2ccccc2n1C
: