Target
Heat shock factor protein 1
Ligand
BDBM63392
Substrate
Meas. Tech.
Luminescence Cell-Based Dose Confimation HTS to Identify Inhibitors of Heat Shock Factor 1 (HSF1)
EC50
>195000±0 nM
Citation
 PubChem, PC Luminescence Cell-Based Dose Confimation HTS to Identify Inhibitors of Heat Shock Factor 1 (HSF1) PubChem Bioassay (2010)[AID] 
Target
Name:
Heat shock factor protein 1
Synonyms:
HSF1_MOUSE Hsf1 protein
Type:
Enzyme Catalytic Domain
Mol. Mass.:
57208.68
Organism:
Mus musculus
Description:
P38532
Residue:
525
  
Inhibitor
Name:
BDBM63392
Synonyms:
1-benzyl-3-[3-(dimethylamino)propyl]-1-[(2-keto-8-methyl-1H-quinolin-3-yl)methyl]thiourea 3-[3-(dimethylamino)propyl]-1-[(8-methyl-2-oxidanylidene-1H-quinolin-3-yl)methyl]-1-(phenylmethyl)thiourea MLS000713879 cid_3169792
Type:
Small organic molecule
Emp. Form.:
C24H30N4OS
Mol. Mass.:
422.586
SMILES:
CN(C)CCCNC(=S)N(Cc1ccccc1)Cc1cc2cccc(C)c2[nH]c1=O
: