Target
Heat shock factor protein 1
Ligand
BDBM63394
Substrate
Meas. Tech.
Luminescence Cell-Based Dose Confimation HTS to Identify Inhibitors of Heat Shock Factor 1 (HSF1)
EC50
>195000±0 nM
Citation
 PubChem, PC Luminescence Cell-Based Dose Confimation HTS to Identify Inhibitors of Heat Shock Factor 1 (HSF1) PubChem Bioassay (2010)[AID] 
Target
Name:
Heat shock factor protein 1
Synonyms:
HSF1_MOUSE Hsf1 protein
Type:
Enzyme Catalytic Domain
Mol. Mass.:
57208.68
Organism:
Mus musculus
Description:
P38532
Residue:
525
  
Inhibitor
Name:
BDBM63394
Synonyms:
3-(acetylhydrazinylidene)-N-tert-butylbutanamide MLS000710882 SMR000280649 | cid_3130003
Type:
Small organic molecule
Emp. Form.:
C10H19N3O2
Mol. Mass.:
213.2768
SMILES:
CC(=O)NN=C(C)CC(=O)NC(C)(C)C
: