Target
Heat shock factor protein 1
Ligand
BDBM63400
Substrate
Meas. Tech.
Luminescence Cell-Based Dose Confimation HTS to Identify Inhibitors of Heat Shock Factor 1 (HSF1)
EC50
>195000±0 nM
Citation
 PubChem, PC Luminescence Cell-Based Dose Confimation HTS to Identify Inhibitors of Heat Shock Factor 1 (HSF1) PubChem Bioassay (2010)[AID] 
Target
Name:
Heat shock factor protein 1
Synonyms:
HSF1_MOUSE Hsf1 protein
Type:
Enzyme Catalytic Domain
Mol. Mass.:
57208.68
Organism:
Mus musculus
Description:
P38532
Residue:
525
  
Inhibitor
Name:
BDBM63400
Synonyms:
3-(phenylmethyl)-1-[3-(1-pyrazolyl)propyl]-3-piperidinecarboxylic acid ethyl ester MLS000735089 cid_16187638 ethyl 3-benzyl-1-(3-pyrazol-1-ylpropyl)piperidine-3-carboxylate | ethyl 3-benzyl-1-[3-(1H-pyrazol-1-yl)propyl]piperidine-3-carboxylate
Type:
Small organic molecule
Emp. Form.:
C21H29N3O2
Mol. Mass.:
355.4739
SMILES:
CCOC(=O)C1(Cc2ccccc2)CCCN(CCCn2cccn2)C1
: