Target
Heat shock factor protein 1
Ligand
BDBM63771
Substrate
Meas. Tech.
Luminescence Cell-Based Dose Confimation HTS to Identify Inhibitors of Heat Shock Factor 1 (HSF1)
EC50
<160±0 nM
Citation
 PubChem, PC Luminescence Cell-Based Dose Confimation HTS to Identify Inhibitors of Heat Shock Factor 1 (HSF1) PubChem Bioassay (2010)[AID] 
Target
Name:
Heat shock factor protein 1
Synonyms:
HSF1_MOUSE Hsf1 protein
Type:
Enzyme Catalytic Domain
Mol. Mass.:
57208.68
Organism:
Mus musculus
Description:
P38532
Residue:
525
  
Inhibitor
Name:
BDBM63771
Synonyms:
(5Z)-5-[(E)-3-phenylprop-2-enylidene]-2-(1-pyrrolidinyl)-4-thiazolone (5Z)-5-[(E)-3-phenylprop-2-enylidene]-2-pyrrolidino-2-thiazolin-4-one MLS001012203 cid_694255
Type:
Small organic molecule
Emp. Form.:
C16H16N2OS
Mol. Mass.:
284.376
SMILES:
O=C1N=C(S\C1=C/C=C/c1ccccc1)N1CCCC1
: