Target
Heat shock factor protein 1
Ligand
BDBM52783
Substrate
Meas. Tech.
Luminescence Cell-Based Dose Confimation HTS to Identify Inhibitors of Heat Shock Factor 1 (HSF1)
EC50
<160±0 nM
Citation
 PubChem, PC Luminescence Cell-Based Dose Confimation HTS to Identify Inhibitors of Heat Shock Factor 1 (HSF1) PubChem Bioassay (2010)[AID] 
Target
Name:
Heat shock factor protein 1
Synonyms:
HSF1_MOUSE Hsf1 protein
Type:
Enzyme Catalytic Domain
Mol. Mass.:
57208.68
Organism:
Mus musculus
Description:
P38532
Residue:
525
  
Inhibitor
Name:
BDBM52783
Synonyms:
2-[(4E)-4-(1-anilinoethylidene)-1-(1,3-benzothiazol-2-yl)-5-keto-2-pyrazolin-3-yl]acetic acid methyl ester MLS000779088 cid_7584226 methyl 2-[(4E)-4-(1-anilinoethylidene)-1-(1,3-benzothiazol-2-yl)-5-oxopyrazol-3-yl]acetate | {1-Benzothiazol-2-yl-5-oxo-4-[1-phenylamino-eth-(E)-ylidene]-4,5-dihydro-1H-pyrazol-3-yl}-acetic acid methyl ester
Type:
Small organic molecule
Emp. Form.:
C21H18N4O3S
Mol. Mass.:
406.458
SMILES:
COC(=O)Cc1[nH]n(-c2nc3ccccc3s2)c(=O)c1C(C)=Nc1ccccc1
: