Target
Heat shock factor protein 1
Ligand
BDBM64056
Substrate
Meas. Tech.
Luminescence Cell-Based Dose Confimation HTS to Identify Inhibitors of Heat Shock Factor 1 (HSF1)
EC50
<160±0 nM
Citation
 PubChem, PC Luminescence Cell-Based Dose Confimation HTS to Identify Inhibitors of Heat Shock Factor 1 (HSF1) PubChem Bioassay (2010)[AID] 
Target
Name:
Heat shock factor protein 1
Synonyms:
HSF1_MOUSE Hsf1 protein
Type:
Enzyme Catalytic Domain
Mol. Mass.:
57208.68
Organism:
Mus musculus
Description:
P38532
Residue:
525
  
Inhibitor
Name:
BDBM64056
Synonyms:
MLS001065900 N-[4-(1,3-benzothiazol-2-yl)phenyl]-N-methylcarbamic acid tert-butyl ester cid_24747342 tert-butyl N-[4-(1,3-benzothiazol-2-yl)phenyl]-N-methyl-carbamate | tert-butyl N-[4-(1,3-benzothiazol-2-yl)phenyl]-N-methylcarbamate
Type:
Small organic molecule
Emp. Form.:
C19H20N2O2S
Mol. Mass.:
340.439
SMILES:
CN(C(=O)OC(C)(C)C)c1ccc(cc1)-c1nc2ccccc2s1
: