Target
Heat shock factor protein 1
Ligand
BDBM62274
Substrate
Meas. Tech.
Luminescence Cell-Based Dose Confimation HTS to Identify Inhibitors of Heat Shock Factor 1 (HSF1)
EC50
<160±0 nM
Citation
 PubChem, PC Luminescence Cell-Based Dose Confimation HTS to Identify Inhibitors of Heat Shock Factor 1 (HSF1) PubChem Bioassay (2010)[AID] 
Target
Name:
Heat shock factor protein 1
Synonyms:
HSF1_MOUSE Hsf1 protein
Type:
Enzyme Catalytic Domain
Mol. Mass.:
57208.68
Organism:
Mus musculus
Description:
P38532
Residue:
525
  
Inhibitor
Name:
BDBM62274
Synonyms:
4-tert-butylbenzoic acid [(Z)-[amino(phenyl)methylene]amino] ester MLS-0412172.0001 [(Z)-[azanyl(phenyl)methylidene]amino] 4-tert-butylbenzoate | cid_6243882
Type:
Small organic molecule
Emp. Form.:
C18H20N2O2
Mol. Mass.:
296.3636
SMILES:
CC(C)(C)c1ccc(cc1)C(=O)ON=C(N)c1ccccc1
: