Target
G-protein coupled receptor 35
Ligand
BDBM38909
Substrate
Meas. Tech.
SAR analysis of compounds that inhibit NOD1 - Set 2
IC50
2610±n/a nM
Citation
 PubChem, PC SAR analysis of compounds that inhibit NOD1 - Set 2 PubChem Bioassay (2010)[AID] 
Target
Name:
G-protein coupled receptor 35
Synonyms:
G protein-coupled receptor 35 GPR35_HUMAN
Type:
Enzyme Catalytic Domain
Mol. Mass.:
34085.57
Organism:
Homo sapiens (Human)
Description:
gi_33695097
Residue:
309
  
Inhibitor
Name:
BDBM38909
Synonyms:
7-[(E)-3-chloranylbut-2-enyl]-1,3-dimethyl-8-(2-phenylethylamino)purine-2,6-dione 7-[(E)-3-chlorobut-2-enyl]-1,3-dimethyl-8-(phenethylamino)xanthine SMR000044779 | cid_5389756
Type:
Small organic molecule
Emp. Form.:
C19H22ClN5O2
Mol. Mass.:
387.863
SMILES:
C\C(Cl)=C/Cn1c(NCCc2ccccc2)nc2n(C)c(=O)n(C)c(=O)c12
: