Target
Beta-lactamase
Ligand
BDBM66145
Substrate
Meas. Tech.
Epi-absorbance-based dose response assay for common IMP-1 and VIM-2 inhibitors: biochemical high throughput screening assay to identify inhibitors of IMP-1metallo-beta-lactamase
IC50
47502±n/a nM
Citation
 PubChem, PC Epi-absorbance-based dose response assay for common IMP-1 and VIM-2 inhibitors: biochemical high throughput screening assay to identify inhibitors of IMP-1metallo-beta-lactamase PubChem Bioassay (2010)[AID] 
Target
Name:
Beta-lactamase
Synonyms:
Beta-lactamase | metallo-beta-lactamase IMP-1
Type:
Enzyme Catalytic Domain
Mol. Mass.:
27125.88
Organism:
Pseudomonas aeruginosa
Description:
gi_27368096
Residue:
246
  
Inhibitor
Name:
BDBM66145
Synonyms:
MLS000948311 N-[4-[[4-(trifluoromethyl)phenyl]carbamoyl]phenyl]tetrahydrofuran-2-carboxamide SMR000621339 | cid_15994190
Type:
Small organic molecule
Emp. Form.:
C19H17F3N2O3
Mol. Mass.:
378.3451
SMILES:
FC(F)(F)c1ccc(NC(=O)c2ccc(NC(=O)C3CCCO3)cc2)cc1
: