Target
Bcl-2-like protein 11
Ligand
BDBM67065
Substrate
Meas. Tech.
Luminescence Cell-Based Dose Retest to Identify Inhibitors of A1 Apoptosis
EC50
>350000±n/a nM
Citation
 PubChem, PC Luminescence Cell-Based Dose Retest to Identify Inhibitors of A1 Apoptosis PubChem Bioassay (2010)[AID] 
Target
Name:
Bcl-2-like protein 11
Synonyms:
B2L11_HUMAN BCL2L11 | BIM
Type:
PROTEIN
Mol. Mass.:
22175.26
Organism:
Homo sapiens (Human)
Description:
EBI_101325
Residue:
198
  
Inhibitor
Name:
BDBM67065
Synonyms:
1-(3,5-dimethyl-1,2-oxazol-4-yl)-3-[(2S,3S)-2-[[(4-methoxyphenyl)sulfonyl-methyl-amino]methyl]-3-methyl-6-oxidanylidene-5-[(2R)-1-oxidanylpropan-2-yl]-3,4-dihydro-2H-1,5-benzoxazocin-8-yl]urea 1-(3,5-dimethyl-4-isoxazolyl)-3-[(2S,3S)-5-[(2R)-1-hydroxypropan-2-yl]-2-[[(4-methoxyphenyl)sulfonyl-methylamino]methyl]-3-methyl-6-oxo-3,4-dihydro-2H-1,5-benzoxazocin-8-yl]urea MLS002474136 cid_44202775
Type:
Small organic molecule
Emp. Form.:
C29H37N5O8S
Mol. Mass.:
615.698
SMILES:
COc1ccc(cc1)S(=O)(=O)N(C)C[C@H]1Oc2ccc(NC(=O)Nc3c(C)noc3C)cc2C(=O)N(C[C@@H]1C)[C@H](C)CO
: