Target
Female germline-specific tumor suppressor gld-1
Ligand
BDBM32120
Substrate
Meas. Tech.
Fluorescence polarization-based biochemical high throughput dose response assay for inhibitors of GLD-1 protein - TGE RNA interaction
IC50
5004±n/a nM
Citation
 PubChem, PC Fluorescence polarization-based biochemical high throughput dose response assay for inhibitors of GLD-1 protein - TGE RNA interaction PubChem Bioassay (2010)[AID] 
Target
Name:
Female germline-specific tumor suppressor gld-1
Synonyms:
GLD1_CAEEL gld-1
Type:
Enzyme Catalytic Domain
Mol. Mass.:
50591.33
Organism:
Caenorhabditis elegans
Description:
gi_17507875
Residue:
463
  
Inhibitor
Name:
BDBM32120
Synonyms:
2-[[2-(4-methoxyphenyl)-5-methyl-1,3-oxazol-4-yl]methylsulfinyl]-N-(pyridin-2-ylmethyl)acetamide 2-[[2-(4-methoxyphenyl)-5-methyl-4-oxazolyl]methylsulfinyl]-N-(2-pyridinylmethyl)acetamide MLS000117623 cid_5308158
Type:
Small organic molecule
Emp. Form.:
C20H21N3O4S
Mol. Mass.:
399.463
SMILES:
COc1ccc(cc1)-c1nc(CS(=O)CC(=O)NCc2ccccn2)c(C)o1
: