Target
Female germline-specific tumor suppressor gld-1
Ligand
BDBM50181
Substrate
Meas. Tech.
Fluorescence polarization-based biochemical high throughput dose response assay for inhibitors of GLD-1 protein - TGE RNA interaction
IC50
868.25±n/a nM
Citation
 PubChem, PC Fluorescence polarization-based biochemical high throughput dose response assay for inhibitors of GLD-1 protein - TGE RNA interaction PubChem Bioassay (2010)[AID] 
Target
Name:
Female germline-specific tumor suppressor gld-1
Synonyms:
GLD1_CAEEL gld-1
Type:
Enzyme Catalytic Domain
Mol. Mass.:
50591.33
Organism:
Caenorhabditis elegans
Description:
gi_17507875
Residue:
463
  
Inhibitor
Name:
BDBM50181
Synonyms:
1-{[4-(dimethylamino)phenyl]amino}-3-methyl-3H-naphtho[1,2,3-de]quinoline-2,7-dione SMR000195982 | cid_1328059
Type:
Small organic molecule
Emp. Form.:
C25H21N3O2
Mol. Mass.:
395.4531
SMILES:
CN(C)c1ccc(Nc2c3-c4ccccc4C(=O)c4cccc(n(C)c2=O)c34)cc1
: