Target
Female germline-specific tumor suppressor gld-1
Ligand
BDBM67428
Substrate
Meas. Tech.
Fluorescence polarization-based biochemical high throughput dose response assay for inhibitors of GLD-1 protein - TGE RNA interaction
IC50
1103±n/a nM
Citation
 PubChem, PC Fluorescence polarization-based biochemical high throughput dose response assay for inhibitors of GLD-1 protein - TGE RNA interaction PubChem Bioassay (2010)[AID] 
Target
Name:
Female germline-specific tumor suppressor gld-1
Synonyms:
GLD1_CAEEL gld-1
Type:
Enzyme Catalytic Domain
Mol. Mass.:
50591.33
Organism:
Caenorhabditis elegans
Description:
gi_17507875
Residue:
463
  
Inhibitor
Name:
BDBM67428
Synonyms:
(E)-2-cyano-3-(2-nitrophenyl)-N-prop-2-enyl-2-propenamide (E)-2-cyano-3-(2-nitrophenyl)-N-prop-2-enylprop-2-enamide MLS000391528 cid_2378168
Type:
Small organic molecule
Emp. Form.:
C13H11N3O3
Mol. Mass.:
257.2447
SMILES:
[O-][N+](=O)c1ccccc1\C=C(/C#N)C(=O)NCC=C
: