Target
Female germline-specific tumor suppressor gld-1
Ligand
BDBM50094893
Substrate
Meas. Tech.
Fluorescence polarization-based biochemical high throughput dose response assay for inhibitors of GLD-1 protein - TGE RNA interaction
IC50
3047±n/a nM
Citation
 PubChem, PC Fluorescence polarization-based biochemical high throughput dose response assay for inhibitors of GLD-1 protein - TGE RNA interaction PubChem Bioassay (2010)[AID] 
Target
Name:
Female germline-specific tumor suppressor gld-1
Synonyms:
GLD1_CAEEL gld-1
Type:
Enzyme Catalytic Domain
Mol. Mass.:
50591.33
Organism:
Caenorhabditis elegans
Description:
gi_17507875
Residue:
463
  
Inhibitor
Name:
BDBM50094893
Synonyms:
1-Amino-4-hydroxy-anthraquinone CHEMBL88326 | cid_8323
Type:
Small organic molecule
Emp. Form.:
C14H9NO3
Mol. Mass.:
239.2262
SMILES:
Nc1ccc(O)c2C(=O)c3ccccc3C(=O)c12
: