Target
Female germline-specific tumor suppressor gld-1
Ligand
BDBM67432
Substrate
Meas. Tech.
Fluorescence polarization-based biochemical high throughput dose response assay for inhibitors of GLD-1 protein - TGE RNA interaction
IC50
2900±n/a nM
Citation
 PubChem, PC Fluorescence polarization-based biochemical high throughput dose response assay for inhibitors of GLD-1 protein - TGE RNA interaction PubChem Bioassay (2010)[AID] 
Target
Name:
Female germline-specific tumor suppressor gld-1
Synonyms:
GLD1_CAEEL gld-1
Type:
Enzyme Catalytic Domain
Mol. Mass.:
50591.33
Organism:
Caenorhabditis elegans
Description:
gi_17507875
Residue:
463
  
Inhibitor
Name:
BDBM67432
Synonyms:
3-(trifluoromethyl)-1H-benzo[g]quinoxalin-2-one MLS000686612 cid_1502798
Type:
Small organic molecule
Emp. Form.:
C13H7F3N2O
Mol. Mass.:
264.2027
SMILES:
FC(F)(F)c1nc2cc3ccccc3cc2[nH]c1=O
: