Target
Female germline-specific tumor suppressor gld-1
Ligand
BDBM52768
Substrate
Meas. Tech.
Fluorescence polarization-based biochemical high throughput dose response assay for inhibitors of GLD-1 protein - TGE RNA interaction
IC50
5408±n/a nM
Citation
 PubChem, PC Fluorescence polarization-based biochemical high throughput dose response assay for inhibitors of GLD-1 protein - TGE RNA interaction PubChem Bioassay (2010)[AID] 
Target
Name:
Female germline-specific tumor suppressor gld-1
Synonyms:
GLD1_CAEEL gld-1
Type:
Enzyme Catalytic Domain
Mol. Mass.:
50591.33
Organism:
Caenorhabditis elegans
Description:
gi_17507875
Residue:
463
  
Inhibitor
Name:
BDBM52768
Synonyms:
(5E)-4-(1,3-benzothiazol-2-yl)-5-(2-hydroxy-3-methyl-4-oxo-1-cyclohexa-2,5-dienylidene)-1,2-dihydropyrazole-3-carboxylic acid (5E)-4-(1,3-benzothiazol-2-yl)-5-(2-hydroxy-4-keto-3-methyl-cyclohexa-2,5-dien-1-ylidene)-3-pyrazoline-3-carboxylic acid 4-Benzothiazol-2-yl-5-(2,4-dihydroxy-3-methyl-phenyl)-2H-pyrazole-3-carboxylic acid SMR000414335 | cid_16681760
Type:
Small organic molecule
Emp. Form.:
C18H13N3O4S
Mol. Mass.:
367.379
SMILES:
Cc1c(O)ccc(-c2n[nH]c(C(O)=O)c2-c2nc3ccccc3s2)c1O
: