Target
UDP-galactopyranose mutase
Ligand
BDBM68233
Substrate
Meas. Tech.
High-throughput FP Assay
Kd
8.0e+3± 1.0e+3 nM
Citation
 Carlson, EEMay, JFKiessling, LL Chemical probes of UDP-galactopyranose mutase. Chem Biol 13:825-37 (2006)  
Target
Name:
UDP-galactopyranose mutase
Synonyms:
GLF_MYCTU Uridine 5'-diphosphate-galactopyranose mutase (UGM) | glf
Type:
Protein
Mol. Mass.:
45807.82
Organism:
Mycobacterium tuberculosis H37Rv
Description:
P9WIQ1
Residue:
399
  
Inhibitor
Name:
BDBM68233
Synonyms:
Pyridin analog, 11
Type:
Small organic molecule
Emp. Form.:
C18H11N3O4
Mol. Mass.:
333.2976
SMILES:
O=C1N(Cc2cccnc2)C(=O)c2ccc(c3cccc1c23)N(=O)=O
: