Target
UDP-galactopyranose mutase
Ligand
BDBM68245
Substrate
Meas. Tech.
High-throughput FP Assay
Kd
>3.3e+4±n/a nM
Citation
 Carlson, EEMay, JFKiessling, LL Chemical probes of UDP-galactopyranose mutase. Chem Biol 13:825-37 (2006)  
Target
Name:
UDP-galactopyranose mutase
Synonyms:
Type:
Protein
Mol. Mass.:
44526.00
Organism:
Klebsiella pneumoniae
Description:
Q762K7
Residue:
384
  
Inhibitor
Name:
BDBM68245
Synonyms:
Thiazolidinone core, 31
Type:
Small organic molecule
Emp. Form.:
C11H7NO3S2
Mol. Mass.:
265.308
SMILES:
OC(=O)N1C(=S)S\C(=C\c2ccccc2)C1=O
: