Target
UDP-galactopyranose mutase
Ligand
BDBM68239
Substrate
Meas. Tech.
High-throughput FP Assay
Kd
>3.3e+4±n/a nM
Citation
 Carlson, EEMay, JFKiessling, LL Chemical probes of UDP-galactopyranose mutase. Chem Biol 13:825-37 (2006)  
Target
Name:
UDP-galactopyranose mutase
Synonyms:
GLF_MYCTU Uridine 5'-diphosphate-galactopyranose mutase (UGM) | glf
Type:
Protein
Mol. Mass.:
45807.82
Organism:
Mycobacterium tuberculosis H37Rv
Description:
P9WIQ1
Residue:
399
  
Inhibitor
Name:
BDBM68239
Synonyms:
Thiazolidinone core, 23
Type:
Small organic molecule
Emp. Form.:
C19H14FNO3S2
Mol. Mass.:
387.448
SMILES:
OC(=O)C(Cc1ccccc1)N1C(=S)S\C(=C\c2cccc(F)c2)C1=O
: