Target
Cannabinoid receptor 2
Ligand
BDBM61033
Substrate
Meas. Tech.
SAR analysis of antagonists of the Cannabinoid Receptor 2 using an Image-Based Assay - Set 2
IC50
>32000±n/a nM
Citation
 PubChem, PC SAR analysis of antagonists of the Cannabinoid Receptor 2 using an Image-Based Assay - Set 2 PubChem Bioassay (2010)[AID] 
Target
Name:
Cannabinoid receptor 2
Synonyms:
CANNABINOID CB2 CB2 CB2B CNR2_HUMAN Cannabinoid CB2 receptor Cannabinoid receptor 2 (CB2R) | hCB2
Type:
G Protein-Coupled Receptor (GPCR)
Mol. Mass.:
39690.94
Organism:
Homo sapiens (Human)
Description:
P34972
Residue:
360
  
Inhibitor
Name:
BDBM61033
Synonyms:
(E)-3-(2-methoxyphenyl)-N-[[4-[methyl(phenyl)sulfamoyl]anilino]-sulfanylidenemethyl]-2-propenamide (E)-3-(2-methoxyphenyl)-N-[[4-[methyl(phenyl)sulfamoyl]phenyl]thiocarbamoyl]acrylamide MLS000539758 cid_1792197
Type:
Small organic molecule
Emp. Form.:
C24H23N3O4S2
Mol. Mass.:
481.587
SMILES:
COc1ccccc1C=CC(=O)NC(=S)Nc1ccc(cc1)S(=O)(=O)N(C)c1ccccc1
: