Target
Cannabinoid receptor 2
Ligand
BDBM61031
Substrate
Meas. Tech.
SAR analysis of antagonists of the Cannabinoid Receptor 2 using an Image-Based Assay - Set 2
IC50
>32000±n/a nM
Citation
 PubChem, PC SAR analysis of antagonists of the Cannabinoid Receptor 2 using an Image-Based Assay - Set 2 PubChem Bioassay (2010)[AID] 
Target
Name:
Cannabinoid receptor 2
Synonyms:
CANNABINOID CB2 CB2 CB2B CNR2_HUMAN Cannabinoid CB2 receptor Cannabinoid receptor 2 (CB2R) | hCB2
Type:
G Protein-Coupled Receptor (GPCR)
Mol. Mass.:
39690.94
Organism:
Homo sapiens (Human)
Description:
P34972
Residue:
360
  
Inhibitor
Name:
BDBM61031
Synonyms:
MLS000540201 N-[[4-(diallylsulfamoyl)phenyl]thiocarbamoyl]-4-phenyl-benzamide N-[[4-[bis(prop-2-enyl)sulfamoyl]phenyl]carbamothioyl]-4-phenyl-benzamide SMR000162378 | cid_1792579
Type:
Small organic molecule
Emp. Form.:
C26H25N3O3S2
Mol. Mass.:
491.625
SMILES:
C=CCN(CC=C)S(=O)(=O)c1ccc(NC(=S)NC(=O)c2ccc(cc2)-c2ccccc2)cc1
: