Target
Cannabinoid receptor 2
Ligand
BDBM62390
Substrate
Meas. Tech.
SAR analysis of antagonists of the Cannabinoid Receptor 2 using an Image-Based Assay - Set 2
IC50
>32000±n/a nM
Citation
 PubChem, PC SAR analysis of antagonists of the Cannabinoid Receptor 2 using an Image-Based Assay - Set 2 PubChem Bioassay (2010)[AID] 
Target
Name:
Cannabinoid receptor 2
Synonyms:
CANNABINOID CB2 CB2 CB2B CNR2_HUMAN Cannabinoid CB2 receptor Cannabinoid receptor 2 (CB2R) | hCB2
Type:
G Protein-Coupled Receptor (GPCR)
Mol. Mass.:
39690.94
Organism:
Homo sapiens (Human)
Description:
P34972
Residue:
360
  
Inhibitor
Name:
BDBM62390
Synonyms:
2-[(7-methoxy-4-methyl-[1,2,4]triazolo[4,3-a]quinolin-1-yl)sulfanyl]-N-methyl-N-(4-phenyl-1,3-thiazol-2-yl)acetamide 2-[(7-methoxy-4-methyl-[1,2,4]triazolo[4,3-a]quinolin-1-yl)thio]-N-methyl-N-(4-phenyl-2-thiazolyl)acetamide MLS-0102574.0001 | cid_1135734
Type:
Small organic molecule
Emp. Form.:
C24H21N5O2S2
Mol. Mass.:
475.586
SMILES:
COc1ccc2c(c1)cc(C)c1nnc(SCC(=O)N(C)c3nc(cs3)-c3ccccc3)n21
: