Target
Cannabinoid receptor 2
Ligand
BDBM61075
Substrate
Meas. Tech.
SAR analysis of antagonists of the Cannabinoid Receptor 2 using an Image-Based Assay - Set 2
IC50
>32000±n/a nM
Citation
 PubChem, PC SAR analysis of antagonists of the Cannabinoid Receptor 2 using an Image-Based Assay - Set 2 PubChem Bioassay (2010)[AID] 
Target
Name:
Cannabinoid receptor 2
Synonyms:
CANNABINOID CB2 CB2 CB2B CNR2_HUMAN Cannabinoid CB2 receptor Cannabinoid receptor 2 (CB2R) | hCB2
Type:
G Protein-Coupled Receptor (GPCR)
Mol. Mass.:
39690.94
Organism:
Homo sapiens (Human)
Description:
P34972
Residue:
360
  
Inhibitor
Name:
BDBM61075
Synonyms:
3-methyl-N-(4-phenylmethoxyphenyl)-2-butenamide MLS000662566 N-[4-(benzyloxy)phenyl]-3-methyl-2-butenamide cid_731806
Type:
Small organic molecule
Emp. Form.:
C18H19NO2
Mol. Mass.:
281.349
SMILES:
[#6]\[#6](-[#6])=[#6]\[#6](=O)-[#7]-c1ccc(-[#8]-[#6]-c2ccccc2)cc1
: