Target
Cannabinoid receptor 2
Ligand
BDBM68297
Substrate
Meas. Tech.
SAR analysis of antagonists of the Cannabinoid Receptor 2 using an Image-Based Assay - Set 2
IC50
>32000±n/a nM
Citation
 PubChem, PC SAR analysis of antagonists of the Cannabinoid Receptor 2 using an Image-Based Assay - Set 2 PubChem Bioassay (2010)[AID] 
Target
Name:
Cannabinoid receptor 2
Synonyms:
CANNABINOID CB2 CB2 CB2B CNR2_HUMAN Cannabinoid CB2 receptor Cannabinoid receptor 2 (CB2R) | hCB2
Type:
G Protein-Coupled Receptor (GPCR)
Mol. Mass.:
39690.94
Organism:
Homo sapiens (Human)
Description:
P34972
Residue:
360
  
Inhibitor
Name:
BDBM68297
Synonyms:
MLS-0433928.0001 [4-(2,3-dimethylphenyl)piperazin-1-yl]-(3-piperidin-1-ylsulfonylphenyl)methanone cid_2518725
Type:
Small organic molecule
Emp. Form.:
C24H31N3O3S
Mol. Mass.:
441.586
SMILES:
Cc1cccc(N2CCN(CC2)C(=O)c2cccc(c2)S(=O)(=O)N2CCCCC2)c1C
: