Target
Cannabinoid receptor 2
Ligand
BDBM68320
Substrate
Meas. Tech.
SAR analysis of antagonists of the Cannabinoid Receptor 2 using an Image-Based Assay - Set 2
IC50
>32000±n/a nM
Citation
 PubChem, PC SAR analysis of antagonists of the Cannabinoid Receptor 2 using an Image-Based Assay - Set 2 PubChem Bioassay (2010)[AID] 
Target
Name:
Cannabinoid receptor 2
Synonyms:
CANNABINOID CB2 CB2 CB2B CNR2_HUMAN Cannabinoid CB2 receptor Cannabinoid receptor 2 (CB2R) | hCB2
Type:
G Protein-Coupled Receptor (GPCR)
Mol. Mass.:
39690.94
Organism:
Homo sapiens (Human)
Description:
P34972
Residue:
360
  
Inhibitor
Name:
BDBM68320
Synonyms:
3-[4-(2-ethoxyphenyl)piperazin-1-yl]carbonyl-N,N-dimethyl-4-pyrrolidin-1-yl-benzenesulfonamide 3-[[4-(2-ethoxyphenyl)-1-piperazinyl]-oxomethyl]-N,N-dimethyl-4-(1-pyrrolidinyl)benzenesulfonamide N,N-dimethyl-3-(4-o-phenetylpiperazine-1-carbonyl)-4-pyrrolidino-benzenesulfonamide | cid_25161603
Type:
Small organic molecule
Emp. Form.:
C25H34N4O4S
Mol. Mass.:
486.627
SMILES:
CCOc1ccccc1N1CCN(CC1)C(=O)c1cc(ccc1N1CCCC1)S(=O)(=O)N(C)C
: