Target
Glycogen synthase kinase-3 beta
Ligand
BDBM69028
Substrate
Meas. Tech.
Luminescence Cell-Free Homogeneous Dose Retest to Identify Inhibitors of Glycogen Synthase Kinase-3 beta Activity
EC50
>300000±n/a nM
Citation
 PubChem, PC Luminescence Cell-Free Homogeneous Dose Retest to Identify Inhibitors of Glycogen Synthase Kinase-3 beta Activity PubChem Bioassay (2010)[AID] 
Target
Name:
Glycogen synthase kinase-3 beta
Synonyms:
GSK-3 beta GSK3B Glycogen synthase kinase 3 beta (GSK3B) Glycogen synthase kinase-3 beta (GSK-3B) Glycogen synthase kinase-3 beta (GSK3B) Glycogen synthase kinase-3beta (GSK3B) | Serine/threonine-protein kinase GSK3B
Type:
Enzyme
Mol. Mass.:
46756.38
Organism:
Homo sapiens (Human)
Description:
P49841
Residue:
420
  
Inhibitor
Name:
BDBM69028
Synonyms:
MLS000665395 N-(4-fluoro-3-nitro-phenyl)-3-phenyl-butyramide SMR000270639 | cid_2916324
Type:
Small organic molecule
Emp. Form.:
C16H15FN2O3
Mol. Mass.:
302.3003
SMILES:
CC(CC(=O)Nc1ccc(F)c(c1)[N+]([O-])=O)c1ccccc1
: