Target
Glycogen synthase kinase-3 beta
Ligand
BDBM69165
Substrate
Meas. Tech.
Luminescence Cell-Free Homogeneous Dose Retest to Identify Inhibitors of Glycogen Synthase Kinase-3 beta Activity
EC50
>300000±n/a nM
Citation
 PubChem, PC Luminescence Cell-Free Homogeneous Dose Retest to Identify Inhibitors of Glycogen Synthase Kinase-3 beta Activity PubChem Bioassay (2010)[AID] 
Target
Name:
Glycogen synthase kinase-3 beta
Synonyms:
GSK-3 beta GSK3B Glycogen synthase kinase 3 beta (GSK3B) Glycogen synthase kinase-3 beta (GSK-3B) Glycogen synthase kinase-3 beta (GSK3B) Glycogen synthase kinase-3beta (GSK3B) | Serine/threonine-protein kinase GSK3B
Type:
Enzyme
Mol. Mass.:
46756.38
Organism:
Homo sapiens (Human)
Description:
P49841
Residue:
420
  
Inhibitor
Name:
BDBM69165
Synonyms:
4-(2-pyridylcarbamoylamino)benzoic acid ethyl ester MLS000679333 cid_6468586 ethyl 4-{[(2-pyridinylamino)carbonyl]amino}benzoate
Type:
Small organic molecule
Emp. Form.:
C15H15N3O3
Mol. Mass.:
285.2979
SMILES:
CCOC(=O)c1ccc(NC(=O)Nc2ccccn2)cc1
: