Target
Glycogen synthase kinase-3 beta
Ligand
BDBM69175
Substrate
Meas. Tech.
Luminescence Cell-Free Homogeneous Dose Retest to Identify Inhibitors of Glycogen Synthase Kinase-3 beta Activity
EC50
>300000±n/a nM
Citation
 PubChem, PC Luminescence Cell-Free Homogeneous Dose Retest to Identify Inhibitors of Glycogen Synthase Kinase-3 beta Activity PubChem Bioassay (2010)[AID] 
Target
Name:
Glycogen synthase kinase-3 beta
Synonyms:
GSK-3 beta GSK3B Glycogen synthase kinase 3 beta (GSK3B) Glycogen synthase kinase-3 beta (GSK-3B) Glycogen synthase kinase-3 beta (GSK3B) Glycogen synthase kinase-3beta (GSK3B) | Serine/threonine-protein kinase GSK3B
Type:
Enzyme
Mol. Mass.:
46756.38
Organism:
Homo sapiens (Human)
Description:
P49841
Residue:
420
  
Inhibitor
Name:
BDBM69175
Synonyms:
1-[(1-ethyl-3-methyl-4-pyrazolyl)methyl]-4-[(3-fluorophenyl)methyl]-4-piperidinecarboxylic acid ethyl ester MLS000735174 cid_16190624 ethyl 1-[(1-ethyl-3-methyl-pyrazol-4-yl)methyl]-4-[(3-fluorophenyl)methyl]piperidine-4-carboxylate | ethyl 1-[(1-ethyl-3-methylpyrazol-4-yl)methyl]-4-[(3-fluorophenyl)methyl]piperidine-4-carboxylate
Type:
Small organic molecule
Emp. Form.:
C22H30FN3O2
Mol. Mass.:
387.4909
SMILES:
CCOC(=O)C1(Cc2cccc(F)c2)CCN(Cc2cn(CC)nc2C)CC1
: