Target
Protein Rev
Ligand
BDBM64781
Substrate
Meas. Tech.
Counterscreen for inhibitors of gld-1: Fluorescence polarization-based biochemical high throughput dose response assay for inhibitors of the HIV Rev protein-RRE RNA interaction
IC50
1364±n/a nM
Citation
 PubChem, PC Counterscreen for inhibitors of gld-1: Fluorescence polarization-based biochemical high throughput dose response assay for inhibitors of the HIV Rev protein-RRE RNA interaction PubChem Bioassay (2010)[AID] 
Target
Name:
Protein Rev
Synonyms:
Human immunodeficiency virus type 1 REV rev
Type:
PROTEIN
Mol. Mass.:
13078.11
Organism:
Human immunodeficiency virus 1
Description:
ChEMBL_79479
Residue:
116
  
Inhibitor
Name:
BDBM64781
Synonyms:
4-[[2-(2,6-dipyrrolidin-1-ylpyrimidin-4-yl)hydrazinyl]methylidene]cyclohexa-2,5-dien-1-one 4-[[[2,6-bis(1-pyrrolidinyl)-4-pyrimidinyl]hydrazo]methylidene]-1-cyclohexa-2,5-dienone MLS000578760 cid_5340670
Type:
Small organic molecule
Emp. Form.:
C19H24N6O
Mol. Mass.:
352.4335
SMILES:
Oc1ccc(CN=Nc2cc(nc(n2)N2CCCC2)N2CCCC2)cc1
: