Target
Cytochrome b-245 heavy chain
Ligand
BDBM42323
Substrate
Meas. Tech.
Late stage results from the probe development effort to identify inhibitors of (NADPH oxidase 1) NOX1: Family selectivity: Set 2
IC50
5000±n/a nM
Citation
 PubChem, PC Late stage results from the probe development effort to identify inhibitors of (NADPH oxidase 1) NOX1: Family selectivity: Set 2 PubChem Bioassay (2010)[AID] 
Target
Name:
Cytochrome b-245 heavy chain
Synonyms:
CGD91-phox CYBB Cytochrome b-245, beta polypeptide [Homo sapiens] Heme-binding membrane glycoprotein gp91phox NADPH oxidase 2 (NOX2) Neutrophil cytochrome b 91 kDa polypeptide gp91-1 p22 phagocyte B-cytochrome
Type:
Enzyme
Mol. Mass.:
65355.82
Organism:
Homo sapiens (Human)
Description:
P04839
Residue:
570
  
Inhibitor
Name:
BDBM42323
Synonyms:
1-(10H-phenothiazin-2-yl)ethanone SMR000033635 | cid_81131
Type:
Small organic molecule
Emp. Form.:
C14H11NOS
Mol. Mass.:
241.308
SMILES:
CC(=O)c1ccc2Sc3ccccc3Nc2c1
: