Target
Importin subunit alpha-1
Ligand
BDBM74902
Substrate
Meas. Tech.
Fluorescence Cell-Free Homogeneous Counterscreen to Identify Inhibitors of the RanGTP-Importin-beta complex.
EC50
>500000±n/a nM
Citation
 PubChem, PC Fluorescence Cell-Free Homogeneous Counterscreen to Identify Inhibitors of the RanGTP-Importin-beta complex. PubChem Bioassay (2010)[AID] 
Target
Name:
Importin subunit alpha-1
Synonyms:
IMA1_HUMAN RCH1 karyopherin alpha 2 (RAG cohort 1, importin alpha 1), isoform CRA_b
Type:
Enzyme Catalytic Domain
Mol. Mass.:
57852.15
Organism:
Homo sapiens (Human)
Description:
gi_119609447
Residue:
529
  
Inhibitor
Name:
BDBM74902
Synonyms:
1-benzoyl-2-methyl-3-pyrroline-2-carboxylic acid 5-methyl-1-(phenylcarbonyl)-2H-pyrrole-5-carboxylic acid SMR000389129 | cid_5459687
Type:
Small organic molecule
Emp. Form.:
C13H13NO3
Mol. Mass.:
231.2472
SMILES:
CC1(C=CCN1C(=O)c1ccccc1)C(O)=O
: