Target
Intestinal-type alkaline phosphatase
Ligand
BDBM45070
Substrate
Meas. Tech.
Dose Response concentration confirmation of uHTS hits from a small molecule activators of human intestinal alkaline phosphatase via a luminescent assay
EC50
6530±n/a nM
Citation
 PubChem, PC Dose Response concentration confirmation of uHTS hits from a small molecule activators of human intestinal alkaline phosphatase via a luminescent assay PubChem Bioassay (2010)[AID] 
Target
Name:
Intestinal-type alkaline phosphatase
Synonyms:
ALPI Intestinal alkaline phosphatase | PPBI_HUMAN
Type:
PROTEIN
Mol. Mass.:
56804.94
Organism:
Homo sapiens (Human)
Description:
ChEMBL_1278525
Residue:
528
  
Inhibitor
Name:
BDBM45070
Synonyms:
4-Methyl-5-oxo-4,5-dihydro-1H-pyrazole-3-carboxylic acid (2-hydroxy-3-methoxy-benzylidene)-hydrazide MLS000548638 N'-[(E)-(5-methoxy-6-oxo-1-cyclohexa-2,4-dienylidene)methyl]-4-methyl-5-oxo-1,4-dihydropyrazole-3-carbohydrazide SMR000171668 | cid_5336771
Type:
Small organic molecule
Emp. Form.:
C13H14N4O4
Mol. Mass.:
290.2747
SMILES:
COc1cccc(C=NNC(=O)c2[nH][nH]c(=O)c2C)c1O
: