Target
Intestinal-type alkaline phosphatase
Ligand
BDBM75624
Substrate
Meas. Tech.
Dose Response concentration confirmation of uHTS hits from a small molecule activators of human intestinal alkaline phosphatase via a luminescent assay
EC50
7610±n/a nM
Citation
 PubChem, PC Dose Response concentration confirmation of uHTS hits from a small molecule activators of human intestinal alkaline phosphatase via a luminescent assay PubChem Bioassay (2010)[AID] 
Target
Name:
Intestinal-type alkaline phosphatase
Synonyms:
ALPI Intestinal alkaline phosphatase | PPBI_HUMAN
Type:
PROTEIN
Mol. Mass.:
56804.94
Organism:
Homo sapiens (Human)
Description:
ChEMBL_1278525
Residue:
528
  
Inhibitor
Name:
BDBM75624
Synonyms:
4-Bromo-2H-pyrazole-3-carboxylic acid (2-hydroxy-5-methyl-benzylidene)-hydrazide 4-bromo-N'-[(E)-(3-methyl-6-oxo-1-cyclohexa-2,4-dienylidene)methyl]-1H-pyrazole-5-carbohydrazide 4-bromo-N'-[(E)-(6-keto-3-methyl-cyclohexa-2,4-dien-1-ylidene)methyl]-1H-pyrazole-5-carbohydrazide SMR000171215 | cid_5404589
Type:
Small organic molecule
Emp. Form.:
C12H11BrN4O2
Mol. Mass.:
323.145
SMILES:
Cc1ccc(O)c(C=NNC(=O)c2[nH]ncc2Br)c1
: