Target
Intestinal-type alkaline phosphatase
Ligand
BDBM51349
Substrate
Meas. Tech.
Dose Response concentration confirmation of uHTS hits from a small molecule activators of human intestinal alkaline phosphatase via a luminescent assay
EC50
7500±n/a nM
Citation
 PubChem, PC Dose Response concentration confirmation of uHTS hits from a small molecule activators of human intestinal alkaline phosphatase via a luminescent assay PubChem Bioassay (2010)[AID] 
Target
Name:
Intestinal-type alkaline phosphatase
Synonyms:
ALPI Intestinal alkaline phosphatase | PPBI_HUMAN
Type:
PROTEIN
Mol. Mass.:
56804.94
Organism:
Homo sapiens (Human)
Description:
ChEMBL_1278525
Residue:
528
  
Inhibitor
Name:
BDBM51349
Synonyms:
2-(8-amino-9H-[1,2,4]triazolo[1,5-d][1,2,4]triazepin-5-yl)-5-(4-methoxyphenyl)-3-(trifluoromethyl)-2-pyrazolin-3-ol 2-(8-azanyl-9H-[1,2,4]triazolo[1,5-d][1,2,4]triazepin-5-yl)-5-(4-methoxyphenyl)-3-(trifluoromethyl)-4H-pyrazol-3-ol SMR000290221 | cid_4095928
Type:
Small organic molecule
Emp. Form.:
C16H15F3N8O2
Mol. Mass.:
408.3379
SMILES:
COc1ccc(cc1)C1=NN(C2=NN=C(N)Cc3ncnn23)C(O)(C1)C(F)(F)F
: