Target
Intestinal-type alkaline phosphatase
Ligand
BDBM75636
Substrate
Meas. Tech.
Dose Response concentration confirmation of uHTS hits from a small molecule activators of human intestinal alkaline phosphatase via a luminescent assay
EC50
8340±n/a nM
Citation
 PubChem, PC Dose Response concentration confirmation of uHTS hits from a small molecule activators of human intestinal alkaline phosphatase via a luminescent assay PubChem Bioassay (2010)[AID] 
Target
Name:
Intestinal-type alkaline phosphatase
Synonyms:
ALPI Intestinal alkaline phosphatase | PPBI_HUMAN
Type:
PROTEIN
Mol. Mass.:
56804.94
Organism:
Homo sapiens (Human)
Description:
ChEMBL_1278525
Residue:
528
  
Inhibitor
Name:
BDBM75636
Synonyms:
4-keto-N-[(3-nitrobenzylidene)amino]-1H-quinazoline-2-carboxamide N-[(3-nitrophenyl)methylideneamino]-4-oxidanylidene-1H-quinazoline-2-carboxamide SMR000371011 | cid_3542510
Type:
Small organic molecule
Emp. Form.:
C16H11N5O4
Mol. Mass.:
337.2896
SMILES:
[O-][N+](=O)c1cccc(\C=N\NC(=O)c2[nH+]c3ccccc3c(=O)[n-]2)c1
: