Target
Intestinal-type alkaline phosphatase
Ligand
BDBM52820
Substrate
Meas. Tech.
Dose Response concentration confirmation of uHTS hits from a small molecule activators of human intestinal alkaline phosphatase via a luminescent assay
EC50
8430±n/a nM
Citation
 PubChem, PC Dose Response concentration confirmation of uHTS hits from a small molecule activators of human intestinal alkaline phosphatase via a luminescent assay PubChem Bioassay (2010)[AID] 
Target
Name:
Intestinal-type alkaline phosphatase
Synonyms:
ALPI Intestinal alkaline phosphatase | PPBI_HUMAN
Type:
PROTEIN
Mol. Mass.:
56804.94
Organism:
Homo sapiens (Human)
Description:
ChEMBL_1278525
Residue:
528
  
Inhibitor
Name:
BDBM52820
Synonyms:
2-(3,5-Dimethyl-pyrazol-1-yl)-4-[N'-(4,6-dimethyl-pyrimidin-2-yl)-hydrazino]-pyrimidine-5-carboxylic acid ethyl ester 2-(3,5-dimethylpyrazol-1-yl)-4-[N'-(4,6-dimethylpyrimidin-2-yl)hydrazino]pyrimidine-5-carboxylic acid ethyl ester SMR000436546 ethyl 2-(3,5-dimethylpyrazol-1-yl)-4-[2-(4,6-dimethylpyrimidin-2-yl)hydrazinyl]pyrimidine-5-carboxylate
Type:
Small organic molecule
Emp. Form.:
C18H22N8O2
Mol. Mass.:
382.4197
SMILES:
CCOC(=O)c1cnc(nc1NNc1nc(C)cc(C)n1)-n1nc(C)cc1C
: