Target
Intestinal-type alkaline phosphatase
Ligand
BDBM75658
Substrate
Meas. Tech.
Dose Response concentration confirmation of uHTS hits from a small molecule activators of human intestinal alkaline phosphatase via a luminescent assay
EC50
4970±n/a nM
Citation
 PubChem, PC Dose Response concentration confirmation of uHTS hits from a small molecule activators of human intestinal alkaline phosphatase via a luminescent assay PubChem Bioassay (2010)[AID] 
Target
Name:
Intestinal-type alkaline phosphatase
Synonyms:
ALPI Intestinal alkaline phosphatase | PPBI_HUMAN
Type:
PROTEIN
Mol. Mass.:
56804.94
Organism:
Homo sapiens (Human)
Description:
ChEMBL_1278525
Residue:
528
  
Inhibitor
Name:
BDBM75658
Synonyms:
1,2-bis(6-fluoranyl-1H-benzimidazol-2-yl)ethane-1,2-diol MLS001182368 cid_2747081
Type:
Small organic molecule
Emp. Form.:
C16H12F2N4O2
Mol. Mass.:
330.2889
SMILES:
OC(C(O)c1nc2ccc(F)cc2[nH]1)c1nc2ccc(F)cc2[nH]1
: