Target
Intestinal-type alkaline phosphatase
Ligand
BDBM53236
Substrate
Meas. Tech.
Dose Response concentration confirmation of uHTS hits from a small molecule activators of human intestinal alkaline phosphatase via a luminescent assay
EC50
8070±n/a nM
Citation
 PubChem, PC Dose Response concentration confirmation of uHTS hits from a small molecule activators of human intestinal alkaline phosphatase via a luminescent assay PubChem Bioassay (2010)[AID] 
Target
Name:
Intestinal-type alkaline phosphatase
Synonyms:
ALPI Intestinal alkaline phosphatase | PPBI_HUMAN
Type:
PROTEIN
Mol. Mass.:
56804.94
Organism:
Homo sapiens (Human)
Description:
ChEMBL_1278525
Residue:
528
  
Inhibitor
Name:
BDBM53236
Synonyms:
4-(3-methyl-1-piperidinyl)-N'-(2-methyl-[1,2,4]triazolo[1,5-c]quinazolin-5-yl)-4-oxobutanehydrazide 4-(3-methylpiperidin-1-yl)-N'-(2-methyl-[1,2,4]triazolo[1,5-c]quinazolin-5-yl)-4-oxobutanehydrazide MLS000924775 cid_24789604
Type:
Small organic molecule
Emp. Form.:
C20H25N7O2
Mol. Mass.:
395.4582
SMILES:
CC1CCCN(C1)C(=O)CCC(=O)NNc1nc2ccccc2c2nc(C)nn12
: