Target
Intestinal-type alkaline phosphatase
Ligand
BDBM75691
Substrate
Meas. Tech.
Dose Response concentration confirmation of uHTS hits from a small molecule activators of human intestinal alkaline phosphatase via a luminescent assay
EC50
7170±n/a nM
Citation
 PubChem, PC Dose Response concentration confirmation of uHTS hits from a small molecule activators of human intestinal alkaline phosphatase via a luminescent assay PubChem Bioassay (2010)[AID] 
Target
Name:
Intestinal-type alkaline phosphatase
Synonyms:
ALPI Intestinal alkaline phosphatase | PPBI_HUMAN
Type:
PROTEIN
Mol. Mass.:
56804.94
Organism:
Homo sapiens (Human)
Description:
ChEMBL_1278525
Residue:
528
  
Inhibitor
Name:
BDBM75691
Synonyms:
MLS001235981 N'-[1-(4-fluorophenyl)pyrazolo[3,4-d]pyrimidin-4-yl]-2-furohydrazide SMR000807175 | cid_17017448
Type:
Small organic molecule
Emp. Form.:
C16H11FN6O2
Mol. Mass.:
338.2959
SMILES:
Fc1ccc(cc1)-n1ncc2c(NNC(=O)c3ccco3)ncnc12
: