Target
Oxytocin receptor
Ligand
BDBM75714
Substrate
Meas. Tech.
Counterscreen for vasopressin 1 receptor (V1R) agonists: Fluorescence-based cell-based high throughput dose response assay for agonists of the Oxytocin Receptor (OXTR)
EC50
>29904±n/a nM
Citation
 PubChem, PC Counterscreen for vasopressin 1 receptor (V1R) agonists: Fluorescence-based cell-based high throughput dose response assay for agonists of the Oxytocin Receptor (OXTR) PubChem Bioassay (2010)[AID] 
Target
Name:
Oxytocin receptor
Synonyms:
OT-R OXYR_HUMAN | Oxytocin
Type:
Enzyme Catalytic Domain
Mol. Mass.:
42793.26
Organism:
Homo sapiens (Human)
Description:
Oxytocin OXTR HEK293::B2R9L7
Residue:
389
  
Inhibitor
Name:
BDBM75714
Synonyms:
1-(1-methyl-2-morpholino-2-phenyl-ethyl)-3-(4-nitrophenyl)urea 1-(1-morpholin-4-yl-1-phenylpropan-2-yl)-3-(4-nitrophenyl)urea MLS001018457 cid_3385342
Type:
Small organic molecule
Emp. Form.:
C20H24N4O4
Mol. Mass.:
384.429
SMILES:
CC(NC(=O)Nc1ccc(cc1)[N+]([O-])=O)C(N1CCOCC1)c1ccccc1
: