Target
Type-1 angiotensin II receptor
Ligand
BDBM49381
Substrate
Meas. Tech.
Dose Response screen for antagonists of Angiotensin II Receptor Type 1 to assess selectivity of uHTS small molecule antagonists hits of the APJ receptor
IC50
2238±119 nM
Citation
 PubChem, PC Dose Response screen for antagonists of Angiotensin II Receptor Type 1 to assess selectivity of uHTS small molecule antagonists hits of the APJ receptor PubChem Bioassay (2010)[AID] 
Target
Name:
Type-1 angiotensin II receptor
Synonyms:
AGTR1 AGTR1B AT1 AT1BR AT2R1B Angiotensin II receptor Type-1 angiotensin II receptor (AT1)
Type:
Protein
Mol. Mass.:
41080.75
Organism:
Homo sapiens (Human)
Description:
P30556
Residue:
359
  
Inhibitor
Name:
BDBM49381
Synonyms:
(3-Methyl-pyridin-2-yl)-(4-pyridin-2-yl-thiazol-2-yl)-amine MLS000528306 N-(3-methylpyridin-2-yl)-4-pyridin-2-yl-1,3-thiazol-2-amine US11905258, Example 2-22819 | cid_972880
Type:
Small organic molecule
Emp. Form.:
C14H12N4S
Mol. Mass.:
268.337
SMILES:
Cc1cccnc1Nc1nc(cs1)-c1ccccn1
: