Target
Type-1 angiotensin II receptor
Ligand
BDBM67244
Substrate
Meas. Tech.
Dose Response screen for antagonists of Angiotensin II Receptor Type 1 to assess selectivity of uHTS small molecule antagonists hits of the APJ receptor
IC50
2909±218 nM
Citation
 PubChem, PC Dose Response screen for antagonists of Angiotensin II Receptor Type 1 to assess selectivity of uHTS small molecule antagonists hits of the APJ receptor PubChem Bioassay (2010)[AID] 
Target
Name:
Type-1 angiotensin II receptor
Synonyms:
AGTR1 AGTR1B AT1 AT1BR AT2R1B Angiotensin II receptor Type-1 angiotensin II receptor (AT1)
Type:
Protein
Mol. Mass.:
41080.75
Organism:
Homo sapiens (Human)
Description:
P30556
Residue:
359
  
Inhibitor
Name:
BDBM67244
Synonyms:
6-ethyl-2-(2-pyridinyl)-3H-thieno[2,3-d]pyrimidin-4-one 6-ethyl-2-(2-pyridyl)-3H-thieno[2,3-d]pyrimidin-4-one MLS000705563 cid_852940
Type:
Small organic molecule
Emp. Form.:
C13H11N3OS
Mol. Mass.:
257.311
SMILES:
CCc1cc2c(nc([nH]c2=O)-c2ccccn2)s1
: