Target
Type-1 angiotensin II receptor
Ligand
BDBM55728
Substrate
Meas. Tech.
Dose Response screen for antagonists of Angiotensin II Receptor Type 1 to assess selectivity of uHTS small molecule antagonists hits of the APJ receptor
IC50
3990±290 nM
Citation
 PubChem, PC Dose Response screen for antagonists of Angiotensin II Receptor Type 1 to assess selectivity of uHTS small molecule antagonists hits of the APJ receptor PubChem Bioassay (2010)[AID] 
Target
Name:
Type-1 angiotensin II receptor
Synonyms:
AGTR1 AGTR1B AT1 AT1BR AT2R1B Angiotensin II receptor Type-1 angiotensin II receptor (AT1)
Type:
Protein
Mol. Mass.:
41080.75
Organism:
Homo sapiens (Human)
Description:
P30556
Residue:
359
  
Inhibitor
Name:
BDBM55728
Synonyms:
2-[(5-methyl-1,3-benzoxazol-2-yl)amino]-6-phenyl-1H-pyrimidin-4-one MLS000673648 cid_879675
Type:
Small organic molecule
Emp. Form.:
C18H14N4O2
Mol. Mass.:
318.3294
SMILES:
Cc1ccc2oc(Nc3nc(cc(=O)[nH]3)-c3ccccc3)nc2c1
: