Target
Type-1 angiotensin II receptor
Ligand
BDBM43465
Substrate
Meas. Tech.
Dose Response screen for antagonists of Angiotensin II Receptor Type 1 to assess selectivity of uHTS small molecule antagonists hits of the APJ receptor
IC50
2349±174 nM
Citation
 PubChem, PC Dose Response screen for antagonists of Angiotensin II Receptor Type 1 to assess selectivity of uHTS small molecule antagonists hits of the APJ receptor PubChem Bioassay (2010)[AID] 
Target
Name:
Type-1 angiotensin II receptor
Synonyms:
AGTR1 AGTR1B AT1 AT1BR AT2R1B Angiotensin II receptor Type-1 angiotensin II receptor (AT1)
Type:
Protein
Mol. Mass.:
41080.75
Organism:
Homo sapiens (Human)
Description:
P30556
Residue:
359
  
Inhibitor
Name:
BDBM43465
Synonyms:
(Z)-2,3-bis(chloranyl)-3-[(4-chlorophenyl)methylsulfinyl]-N-(6-methoxypyridin-3-yl)prop-2-enamide (Z)-2,3-dichloro-3-[(4-chlorophenyl)methylsulfinyl]-N-(6-methoxy-3-pyridinyl)-2-propenamide 2,3-dichloro-3-[(4-chlorobenzyl)sulfinyl]-N-(6-methoxy-3-pyridinyl)acrylamide SMR000334340 | cid_1472220
Type:
Small organic molecule
Emp. Form.:
C16H13Cl3N2O3S
Mol. Mass.:
419.71
SMILES:
COc1ccc(NC(=O)C(Cl)=C(Cl)S(=O)Cc2ccc(Cl)cc2)cn1
: