Target
Type-1 angiotensin II receptor
Ligand
BDBM58709
Substrate
Meas. Tech.
Dose Response screen for antagonists of Angiotensin II Receptor Type 1 to assess selectivity of uHTS small molecule antagonists hits of the APJ receptor
IC50
4027±548 nM
Citation
 PubChem, PC Dose Response screen for antagonists of Angiotensin II Receptor Type 1 to assess selectivity of uHTS small molecule antagonists hits of the APJ receptor PubChem Bioassay (2010)[AID] 
Target
Name:
Type-1 angiotensin II receptor
Synonyms:
AGTR1 AGTR1B AT1 AT1BR AT2R1B Angiotensin II receptor Type-1 angiotensin II receptor (AT1)
Type:
Protein
Mol. Mass.:
41080.75
Organism:
Homo sapiens (Human)
Description:
P30556
Residue:
359
  
Inhibitor
Name:
BDBM58709
Synonyms:
3,4-bis(chloranyl)-N-(pyridin-2-ylmethylideneamino)benzamide 3,4-dichloro-N-(2-pyridylmethyleneamino)benzamide MLS001223890 cid_872785
Type:
Small organic molecule
Emp. Form.:
C13H9Cl2N3O
Mol. Mass.:
294.136
SMILES:
Clc1ccc(cc1Cl)C(=O)NN=Cc1ccccn1
: