Target
Photoreceptor-specific nuclear receptor
Ligand
BDBM41094
Substrate
Meas. Tech.
TR-FRET-based biochemical high throughput dose response assay to identify NR2E3 inverse agonists
IC50
3820±n/a nM
Citation
 PubChem, PC TR-FRET-based biochemical high throughput dose response assay to identify NR2E3 inverse agonists PubChem Bioassay (2010)[AID] 
Target
Name:
Photoreceptor-specific nuclear receptor
Synonyms:
NR2E3 PNR photoreceptor-specific nuclear receptor
Type:
PROTEIN
Mol. Mass.:
44699.83
Organism:
Homo sapiens (Human)
Description:
ChEMBL_401901
Residue:
410
  
Inhibitor
Name:
BDBM41094
Synonyms:
1-(9H-fluoren-2-yl)-2-[(4-methyl-5-phenyl-1,2,4-triazol-3-yl)sulfanyl]ethanone 1-(9H-fluoren-2-yl)-2-[(4-methyl-5-phenyl-4H-1,2,4-triazol-3-yl)thio]ethanone SMR000195269 | cid_1339742
Type:
Small organic molecule
Emp. Form.:
C24H19N3OS
Mol. Mass.:
397.492
SMILES:
Cn1c(SCC(=O)c2ccc-3c(Cc4ccccc-34)c2)nnc1-c1ccccc1
: