Target
Photoreceptor-specific nuclear receptor
Ligand
BDBM75980
Substrate
Meas. Tech.
TR-FRET-based biochemical high throughput dose response assay to identify NR2E3 inverse agonists
IC50
3533±n/a nM
Citation
 PubChem, PC TR-FRET-based biochemical high throughput dose response assay to identify NR2E3 inverse agonists PubChem Bioassay (2010)[AID] 
Target
Name:
Photoreceptor-specific nuclear receptor
Synonyms:
NR2E3 PNR photoreceptor-specific nuclear receptor
Type:
PROTEIN
Mol. Mass.:
44699.83
Organism:
Homo sapiens (Human)
Description:
ChEMBL_401901
Residue:
410
  
Inhibitor
Name:
BDBM75980
Synonyms:
2-[6-(1,3-benzodioxol-5-yl)pyridazin-3-yl]sulfanyl-N-(4-ethanoylphenyl)ethanamide N-(4-acetylphenyl)-2-[6-(1,3-benzodioxol-5-yl)pyridazin-3-yl]sulfanylacetamide N-(4-acetylphenyl)-2-[[6-(1,3-benzodioxol-5-yl)pyridazin-3-yl]thio]acetamide cid_7206282
Type:
Small organic molecule
Emp. Form.:
C21H17N3O4S
Mol. Mass.:
407.442
SMILES:
CC(=O)c1ccc(NC(=O)CSc2ccc(nn2)-c2ccc3OCOc3c2)cc1
: