Target
Photoreceptor-specific nuclear receptor
Ligand
BDBM75981
Substrate
Meas. Tech.
TR-FRET-based biochemical high throughput dose response assay to identify NR2E3 inverse agonists
IC50
2636±n/a nM
Citation
 PubChem, PC TR-FRET-based biochemical high throughput dose response assay to identify NR2E3 inverse agonists PubChem Bioassay (2010)[AID] 
Target
Name:
Photoreceptor-specific nuclear receptor
Synonyms:
NR2E3 PNR photoreceptor-specific nuclear receptor
Type:
PROTEIN
Mol. Mass.:
44699.83
Organism:
Homo sapiens (Human)
Description:
ChEMBL_401901
Residue:
410
  
Inhibitor
Name:
BDBM75981
Synonyms:
1-(1-piperidinyl)-2-[(6-thiophen-2-yl-3-pyridazinyl)thio]ethanone 1-piperidin-1-yl-2-(6-thiophen-2-ylpyridazin-3-yl)sulfanylethanone MLS000696678 cid_12006152
Type:
Small organic molecule
Emp. Form.:
C15H17N3OS2
Mol. Mass.:
319.445
SMILES:
O=C(CSc1ccc(nn1)-c1cccs1)N1CCCCC1
: